Target
Cytochrome P450 3A4
Ligand
BDBM50353392
Substrate
Meas. Tech.
ChEMBL_768817 (CHEMBL1831799)
IC50
11000±n/a nM
Citation
 Xu, ZTice, CMZhao, WCacatian, SYe, YJSingh, SBLindblom, PMcKeever, BMKrosky, PMKruk, BABerbaum, JHarrison, RKJohnson, JABukhtiyarov, YPanemangalore, RScott, BBZhao, YBruno, JGTogias, JGuo, JGuo, RCarroll, PJMcGeehan, GMZhuang, LHe, WClaremon, DA Structure-based design and synthesis of 1,3-oxazinan-2-one inhibitors of 11ß-hydroxysteroid dehydrogenase type 1. J Med Chem 54:6050-62 (2011)  
Target
Name:
Cytochrome P450 3A4
Synonyms:
Albendazole monooxygenase CP3A4_HUMAN CYP3A4 CYPIIIA4 Cytochrome P450 3A4 (CYP3A4) Nifedipine oxidase Taurochenodeoxycholate 6-alpha-hydroxylase
Type:
Enzyme
Mol. Mass.:
57349.57
Organism:
Homo sapiens (Human)
Description:
Residue:
503
  
Inhibitor
Name:
BDBM50353392
Synonyms:
CHEMBL1829761 US8592410, Comparator 9 | US8598163, 67
Type:
Small organic molecule
Emp. Form.:
C27H28FNO3
Mol. Mass.:
433.5145
SMILES:
C[C@H](N1CC[C@@](CCCO)(OC1=O)c1ccccc1)c1ccc(cc1)-c1ccc(F)cc1
: