Target
Melanin-concentrating hormone receptor 1
Ligand
BDBM50353455
Substrate
Meas. Tech.
ChEMBL_768152 (CHEMBL1833190)
Ki
2.4±n/a nM
Citation
 Lu, KJiang, YChen, BEldemenky, EMMa, GPackiarajan, MChandrasena, GWhite, ADJones, KALi, BHong, SP Strategies to lower the Pgp efflux liability in a series of potent indole azetidine MCHR1 antagonists. Bioorg Med Chem Lett 21:5310-4 (2011)  
Target
Name:
Melanin-concentrating hormone receptor 1
Synonyms:
G-protein coupled receptor 24 MCH receptor 1 MCH-R1 MCHR MCHR1_RAT Melanin Concentrating Hormone 1 Melanin-concentrating hormone receptor 1 Slc1 | Somatostatin receptor-like protein
Type:
Enzyme Catalytic Domain
Mol. Mass.:
39075.64
Organism:
RAT
Description:
Melanin Concentrating Hormone 1 GPR24 RAT::P97639
Residue:
353
  
Inhibitor
Name:
BDBM50353455
Synonyms:
CHEMBL1830049
Type:
Small organic molecule
Emp. Form.:
C23H23N3O2
Mol. Mass.:
373.4476
SMILES:
O=c1cc(OCc2ccccc2)ccn1-c1ccc2N(CCc2c1)C1CNC1
: