Target
Melanin-concentrating hormone receptor 1
Ligand
BDBM50353456
Substrate
Meas. Tech.
ChEMBL_768152 (CHEMBL1833190)
Ki
2.5±n/a nM
Citation
 Lu, KJiang, YChen, BEldemenky, EMMa, GPackiarajan, MChandrasena, GWhite, ADJones, KALi, BHong, SP Strategies to lower the Pgp efflux liability in a series of potent indole azetidine MCHR1 antagonists. Bioorg Med Chem Lett 21:5310-4 (2011)  
Target
Name:
Melanin-concentrating hormone receptor 1
Synonyms:
G-protein coupled receptor 24 MCH receptor 1 MCH-R1 MCHR MCHR1_RAT Melanin Concentrating Hormone 1 Melanin-concentrating hormone receptor 1 Slc1 | Somatostatin receptor-like protein
Type:
Enzyme Catalytic Domain
Mol. Mass.:
39075.64
Organism:
RAT
Description:
Melanin Concentrating Hormone 1 GPR24 RAT::P97639
Residue:
353
  
Inhibitor
Name:
BDBM50353456
Synonyms:
CHEMBL1830050
Type:
Small organic molecule
Emp. Form.:
C24H25N3O2
Mol. Mass.:
387.4742
SMILES:
CN1CC(C1)N1CCc2cc(ccc12)-n1ccc(OCc2ccccc2)cc1=O
: