Target
Chloroquine resistance transporter
Ligand
BDBM50353744
Substrate
Meas. Tech.
ChEMBL_769822 (CHEMBL1831816)
IC50
36000±n/a nM
Citation
 Zishiri, VKJoshi, MCHunter, RChibale, KSmith, PJSummers, RLMartin, REEgan, TJ Quinoline antimalarials containing a dibemethin group are active against chloroquinone-resistant Plasmodium falciparum and inhibit chloroquine transport via the P. falciparum chloroquine-resistance transporter (PfCRT). J Med Chem 54:6956-68 (2011)  
Target
Name:
Chloroquine resistance transporter
Synonyms:
CRT PfCRT
Type:
PROTEIN
Mol. Mass.:
48687.29
Organism:
Plasmodium falciparum
Description:
ChEMBL_1364181
Residue:
424
  
Inhibitor
Name:
BDBM50353744
Synonyms:
CHEMBL1830986
Type:
Small organic molecule
Emp. Form.:
C25H24ClN3
Mol. Mass.:
401.931
SMILES:
CN(Cc1ccccc1)Cc1cccc(CNc2ccnc3cc(Cl)ccc23)c1
: