Target
Acyl-CoA desaturase 1
Ligand
BDBM50354671
Substrate
Meas. Tech.
ChEMBL_771237 (CHEMBL1839319)
IC50
3±n/a nM
Citation
 Ramtohul, YKPowell, DLeclerc, JPLeger, SOballa, RBlack, CIsabel, ELi, CSCrane, SRobichaud, JGuay, JGuiral, SZhang, LHuang, Z Bicyclic heteroaryl inhibitors of stearoyl-CoA desaturase: from systemic to liver-targeting inhibitors. Bioorg Med Chem Lett 21:5692-6 (2011)  
Target
Name:
Acyl-CoA desaturase 1
Synonyms:
ACOD1_RAT Scd Stearoyl-CoA desaturase 1 (SCD1)
Type:
Enzyme
Mol. Mass.:
41485.97
Organism:
Rattus norvegicus (Rat)
Description:
P07308
Residue:
358
  
Inhibitor
Name:
BDBM50354671
Synonyms:
CHEMBL1834452
Type:
Small organic molecule
Emp. Form.:
C16H15BrFN5O
Mol. Mass.:
392.226
SMILES:
Fc1ccc(Br)c(OC2CCN(CC2)c2ncc3[nH]cnc3n2)c1
: