Target
Neuropeptide Y receptor type 5
Ligand
BDBM50355840
Substrate
Meas. Tech.
ChEMBL_775144 (CHEMBL1912449)
Ki
1.9±n/a nM
Citation
 Packiarajan, MCoate, HDesai, MJimenez, HNReinhard, EJJubian, VJMarzabadi, MRChandrasena, GWolinski, TCWalker, MWAndersen, K 5-(2'-Pyridyl)-2-aminothiazoles: alkyl amino sulfonamides and sulfamides as potent NPY(5) antagonists. Bioorg Med Chem Lett 21:6500-4 (2011)  
Target
Name:
Neuropeptide Y receptor type 5
Synonyms:
NPY-Y5 NPY5-R NPY5R_HUMAN NPYY5 Neuropeptide Y receptor type 5 ( NPY Y5) | Y5 receptor
Type:
Enzyme
Mol. Mass.:
50746.64
Organism:
Homo sapiens (Human)
Description:
Q15761
Residue:
445
  
Inhibitor
Name:
BDBM50355840
Synonyms:
CHEMBL1912082
Type:
Small organic molecule
Emp. Form.:
C21H26N4O3S2
Mol. Mass.:
446.586
SMILES:
COc1ccc(C)cc1S(=O)(=O)NCCCCCNc1nc(cs1)-c1ccccn1
: