Target
Neuropeptide Y receptor type 5
Ligand
BDBM50355854
Substrate
Meas. Tech.
ChEMBL_775144 (CHEMBL1912449)
Ki
1.8±n/a nM
Citation
 Packiarajan, MCoate, HDesai, MJimenez, HNReinhard, EJJubian, VJMarzabadi, MRChandrasena, GWolinski, TCWalker, MWAndersen, K 5-(2'-Pyridyl)-2-aminothiazoles: alkyl amino sulfonamides and sulfamides as potent NPY(5) antagonists. Bioorg Med Chem Lett 21:6500-4 (2011)  
Target
Name:
Neuropeptide Y receptor type 5
Synonyms:
NPY-Y5 NPY5-R NPY5R_HUMAN NPYY5 Neuropeptide Y receptor type 5 ( NPY Y5) | Y5 receptor
Type:
Enzyme
Mol. Mass.:
50746.64
Organism:
Homo sapiens (Human)
Description:
Q15761
Residue:
445
  
Inhibitor
Name:
BDBM50355854
Synonyms:
CHEMBL1909727
Type:
Small organic molecule
Emp. Form.:
C17H27N5O2S2
Mol. Mass.:
397.559
SMILES:
CCN(CC)S(=O)(=O)NCCCCCNc1nc(cs1)-c1ccccn1
: