Target
C-C chemokine receptor type 2
Ligand
BDBM50355895
Substrate
Meas. Tech.
ChEMBL_775844 (CHEMBL1912385)
IC50
925±n/a nM
Citation
 Bhalay, GAlbrecht, BAkhlaq, MBaettig, UBeer, DBrown, ZCharlton, SDunstan, ABradley, MGedeck, PGlen, AHowe, TKeller, TLeighton-Davies, JLi, AMcCarthy, CMocquet, COwen, CNicklin, PRosethorne, E Design and synthesis of a library of chemokine antagonists. Bioorg Med Chem Lett 21:6249-52 (2011)  
Target
Name:
C-C chemokine receptor type 2
Synonyms:
C-C chemokine receptor type 2 (CCR2) CCR2_HUMAN Chemoattractant Cytokine Receptor 2 (CCR2) Monocyte chemotactic protein-1 (MCP-1)
Type:
Enzyme
Mol. Mass.:
41932.32
Organism:
Homo sapiens (Human)
Description:
P41597
Residue:
374
  
Inhibitor
Name:
BDBM50355895
Synonyms:
CHEMBL1910161
Type:
Small organic molecule
Emp. Form.:
C25H28BrFN2O2
Mol. Mass.:
487.404
SMILES:
Fc1ccc(cc1)C1CCN(CCCNC(=O)C2=Cc3cc(Br)ccc3OCC2)CC1
: