Target
Glucocorticoid receptor
Ligand
BDBM50356060
Substrate
Meas. Tech.
ChEMBL_775706 (CHEMBL1912091)
EC50
120±n/a nM
Citation
 Betageri, RGilmore, TKuzmich, DKirrane, TMBentzien, JWiedenmayer, DBekkali, YRegan, JBerry, ALatli, BKukulka, AJFadra, TNNelson, RMGoldrick, SZuvela-Jelaska, LSouza, DPelletier, JDinallo, RPanzenbeck, MTorcellini, CLee, HPack, EHarcken, CNabozny, GThomson, DS Non-steroidal dissociated glucocorticoid agonists: indoles as A-ring mimetics and function-regulating pharmacophores. Bioorg Med Chem Lett 21:6842-51 (2011)  
Target
Name:
Glucocorticoid receptor
Synonyms:
GCR_HUMAN GRL Glucocorticoid receptor (GRFP) Nuclear receptor subfamily 3 group C member 1
Type:
Enzyme
Mol. Mass.:
85656.87
Organism:
Homo sapiens (Human)
Description:
P04150
Residue:
777
  
Inhibitor
Name:
BDBM50356060
Synonyms:
CHEMBL1911664
Type:
Small organic molecule
Emp. Form.:
C25H25F3N2O4S
Mol. Mass.:
506.537
SMILES:
CC(C)(C[C@@](O)(Cc1cc2ccc(cc2[nH]1)C#N)C(F)(F)F)c1cc(cc2CCOc12)S(C)(=O)=O
: