Target
Small conductance calcium-activated potassium channel protein 2
Ligand
BDBM50356162
Substrate
Meas. Tech.
ChEMBL_776011 (CHEMBL1913009)
Ki
397±n/a nM
Citation
 Badarau, EDilly, SDufour, FPoncin, SSeutin, VLiégeois, JF Synthesis and radioligand binding studies of bis-(8-isopropyl-isoquinolinium) derivatives as ligands for apamin-sensitive sites on cloned SK2 and SK3 channels. Bioorg Med Chem Lett 21:6756-9 (2011)  
Target
Name:
Small conductance calcium-activated potassium channel protein 2
Synonyms:
KCNN2 SK2
Type:
PROTEIN
Mol. Mass.:
63788.70
Organism:
Homo sapiens (Human)
Description:
ChEMBL_480083
Residue:
579
  
Inhibitor
Name:
BDBM50356162
Synonyms:
CHEMBL1909932
Type:
Small organic molecule
Emp. Form.:
C34H38N2
Mol. Mass.:
474.6778
SMILES:
CC(C)c1cccc2cc[n+](C)c(Cc3ccc(Cc4[n+](C)ccc5cccc(C(C)C)c45)cc3)c12
: