Target
A disintegrin and metalloproteinase with thrombospondin motifs 4
Ligand
BDBM50356206
Substrate
Meas. Tech.
ChEMBL_774906 (CHEMBL1913351)
IC50
800±n/a nM
Citation
 Hu, YXing, LThomason, JRXiang, JIpek, MGuler, SLi, HSabatini, JChockalingam, PReifenberg, ESheldon, RMorris, EAGeorgiadis, KETam, S Continued exploration of biphenylsulfonamide scaffold as a platform for aggrecanase-1 inhibition. Bioorg Med Chem Lett 21:6800-3 (2011)  
Target
Name:
A disintegrin and metalloproteinase with thrombospondin motifs 4
Synonyms:
A disintegrin and metalloproteinase with thrombospondin motifs 4 (ADAMTS-4) ATS4_HUMAN KIAA0688 | Metalloproteinase with thrombospondin motifs 4 (ADAMTS-4)
Type:
Enzyme
Mol. Mass.:
90214.54
Organism:
Homo sapiens (Human)
Description:
O75173
Residue:
837
  
Inhibitor
Name:
BDBM50356206
Synonyms:
CHEMBL1910459
Type:
Small organic molecule
Emp. Form.:
C28H27NO5S
Mol. Mass.:
489.583
SMILES:
CC(C)[C@@H](NS(=O)(=O)c1ccc(cc1)-c1ccc(OCc2ccc3ccccc3c2)cc1)C(O)=O
: