Target
Collagenase 3
Ligand
BDBM50356206
Substrate
Meas. Tech.
ChEMBL_774908 (CHEMBL1913353)
IC50
1.4±n/a nM
Citation
 Hu, YXing, LThomason, JRXiang, JIpek, MGuler, SLi, HSabatini, JChockalingam, PReifenberg, ESheldon, RMorris, EAGeorgiadis, KETam, S Continued exploration of biphenylsulfonamide scaffold as a platform for aggrecanase-1 inhibition. Bioorg Med Chem Lett 21:6800-3 (2011)  
Target
Name:
Collagenase 3
Synonyms:
MMP-13 MMP13_HUMAN Matrix metalloproteinase-13 (MMP-13) | Matrix metalloproteinase-13 (MMP13)
Type:
Enzyme
Mol. Mass.:
53808.06
Organism:
Homo sapiens (Human)
Description:
P45452
Residue:
471
  
Inhibitor
Name:
BDBM50356206
Synonyms:
CHEMBL1910459
Type:
Small organic molecule
Emp. Form.:
C28H27NO5S
Mol. Mass.:
489.583
SMILES:
CC(C)[C@@H](NS(=O)(=O)c1ccc(cc1)-c1ccc(OCc2ccc3ccccc3c2)cc1)C(O)=O
: