Target
Histone deacetylase 8
Ligand
BDBM50356637
Substrate
Meas. Tech.
ChEMBL_785887 (CHEMBL1921156)
IC50
76±n/a nM
Citation
 Neelarapu, RHolzle, DLVelaparthi, SBai, HBrunsteiner, MBlond, SYPetukhov, PA Design, synthesis, docking, and biological evaluation of novel diazide-containing isoxazole- and pyrazole-based histone deacetylase probes. J Med Chem 54:4350-64 (2011)  
Target
Name:
Histone deacetylase 8
Synonyms:
HD8 HDAC8_HUMAN Histone deacetylase 8 (HDAC-8) | Human HDAC8
Type:
Enzyme
Mol. Mass.:
41749.60
Organism:
Homo sapiens (Human)
Description:
Q9BY41
Residue:
377
  
Inhibitor
Name:
BDBM50356637
Synonyms:
CHEMBL1914703
Type:
Small organic molecule
Emp. Form.:
C18H24N4O3
Mol. Mass.:
344.4082
SMILES:
ONC(=O)CCCCCCC(=O)Nc1cnn(Cc2ccccc2)c1
: