Target
Prostaglandin G/H synthase 2
Ligand
BDBM50357362
Substrate
Meas. Tech.
ChEMBL_787579 (CHEMBL1917972)
IC50
2990±n/a nM
Citation
 Tan, CMChen, GSChen, CSChang, PTChern, JW Design, synthesis and biological evaluation of benzo[1.3.2]dithiazolium ylide 1,1-dioxide derivatives as potential dual cyclooxygenase-2/5-lipoxygenase inhibitors. Bioorg Med Chem 19:6316-28 (2011)  
Target
Name:
Prostaglandin G/H synthase 2
Synonyms:
COX2 Cyclooxygenase 2 (COX-2) Cyclooxygenase-2 (COX-2 AA) Cyclooxygenase-2 (COX-2) PGH2_HUMAN PHS II Prostaglandin E synthase/G/H synthase 2 Prostaglandin-endoperoxide synthase 2
Type:
Enzyme
Mol. Mass.:
69003.89
Organism:
Homo sapiens (Human)
Description:
Recombinant Cox-2 provided by Cayman (Cayman Chemical Co.,Ann Arbor, MI).
Residue:
604
  
Inhibitor
Name:
BDBM50357362
Synonyms:
CHEMBL1917103
Type:
Small organic molecule
Emp. Form.:
C13H7F3N2O4S2
Mol. Mass.:
376.331
SMILES:
[O-][N+](=O)c1ccc2c(c1)S(=O)(=O)N=S2c1ccc(cc1)C(F)(F)F
: