Target
Polyunsaturated fatty acid 5-lipoxygenase
Ligand
BDBM50357362
Substrate
Meas. Tech.
ChEMBL_787580 (CHEMBL1917973)
IC50
3090±n/a nM
Citation
 Tan, CMChen, GSChen, CSChang, PTChern, JW Design, synthesis and biological evaluation of benzo[1.3.2]dithiazolium ylide 1,1-dioxide derivatives as potential dual cyclooxygenase-2/5-lipoxygenase inhibitors. Bioorg Med Chem 19:6316-28 (2011)  
Target
Name:
Polyunsaturated fatty acid 5-lipoxygenase
Synonyms:
5-LO 5-Lipoxygenase (5-LO) 5-Lipoygenase ALOX5 LOG5 | LOX5_HUMAN
Type:
Enzyme
Mol. Mass.:
77972.74
Organism:
Homo sapiens (Human)
Description:
Recombinant protein was purified from E. coli lysate. After ammonium sulfate precipitation and subsequent steps, the supernatant (S100) was used for 5-LO activity assay.
Residue:
674
  
Inhibitor
Name:
BDBM50357362
Synonyms:
CHEMBL1917103
Type:
Small organic molecule
Emp. Form.:
C13H7F3N2O4S2
Mol. Mass.:
376.331
SMILES:
[O-][N+](=O)c1ccc2c(c1)S(=O)(=O)N=S2c1ccc(cc1)C(F)(F)F
: