Target
Serine/threonine-protein kinase pim-2
Ligand
BDBM50357598
Substrate
Meas. Tech.
ChEMBL_788035 (CHEMBL1919014)
IC50
12±n/a nM
Citation
 Pierre, FStefan, ENédellec, ASChevrel, MCRegan, CFSiddiqui-Jain, AMacalino, DStreiner, NDrygin, DHaddach, MO'Brien, SEAnderes, KRyckman, DM 7-(4H-1,2,4-Triazol-3-yl)benzo[c][2,6]naphthyridines: a novel class of Pim kinase inhibitors with potent cell antiproliferative activity. Bioorg Med Chem Lett 21:6687-92 (2011)  
Target
Name:
Serine/threonine-protein kinase pim-2
Synonyms:
PIM2 Pim-2h Serine/threonine-protein kinase PIM | Serine/threonine-protein kinase pim-2 (PIM2)
Type:
Serine/threonine-protein kinase
Mol. Mass.:
34185.93
Organism:
Homo sapiens (Human)
Description:
Q9P1W9
Residue:
311
  
Inhibitor
Name:
BDBM50357598
Synonyms:
CHEMBL1915449
Type:
Small organic molecule
Emp. Form.:
C25H23ClN8
Mol. Mass.:
470.957
SMILES:
CN1CCN(CC1)c1ccc(Nc2nc3c(cccc3c3cnccc23)-c2nnc[nH]2)c(Cl)c1
: