Target
Neuronal acetylcholine receptor subunit alpha-7
Ligand
BDBM50358020
Substrate
Meas. Tech.
ChEMBL_786495 (CHEMBL1921076)
Ki
14.20±n/a nM
Citation
 Dallanoce, CFrigerio, FGrazioso, GMatera, CVisconti, GLDe Amici, MPucci, LPistillo, FFucile, SGotti, CClementi, FDe Micheli, C New spirocyclic¿²-isoxazoline derivatives related to selective agonists ofa7 neuronal nicotinic acetylcholine receptors. Eur J Med Chem 46:5790-9 (2011)  
Target
Name:
Neuronal acetylcholine receptor subunit alpha-7
Synonyms:
ACHA7_RAT Cholinergic, Nicotinic Alpha7 Chrna7 Neuronal acetylcholine receptor (alpha7 nAChR) Neuronal acetylcholine receptor subunit alpha-7 Neuronal acetylcholine receptor subunit alpha-7 (nAChR)
Type:
Enzyme
Mol. Mass.:
56502.44
Organism:
Rattus norvegicus (Rat)
Description:
Q05941
Residue:
502
  
Inhibitor
Name:
BDBM50358020
Synonyms:
CHEMBL1917547
Type:
Small organic molecule
Emp. Form.:
C10H17N2O2
Mol. Mass.:
197.2536
SMILES:
COC1=NOC2(C1)C[NH+]1CCC2CC1
: