Target
Mitogen-activated protein kinase 10
Ligand
BDBM50358497
Substrate
Meas. Tech.
ChEMBL_789936 (CHEMBL1925289)
IC50
7±n/a nM
Citation
 Song, XChen, WLin, LRuiz, CHCameron, MDDuckett, DRKamenecka, TM Synthesis and SAR of 2-phenoxypyridines as novel c-Jun N-terminal kinase inhibitors. Bioorg Med Chem Lett 21:7072-5 (2011)  
Target
Name:
Mitogen-activated protein kinase 10
Synonyms:
JNK3 MAP kinase p49 3F12 MK10_HUMAN Mitogen-activated protein kinase 10 (Stress-activated protein kinase JNK3) (c-Jun N-terminal kinase 3) (MAP kinase p49 3F12) PRKM10 Stress-activated protein kinase JNK3 | c-Jun N-terminal kinase 3 (JNK3)
Type:
Enzyme
Mol. Mass.:
52586.89
Organism:
Homo sapiens (Human)
Description:
Residue:
464
  
Inhibitor
Name:
BDBM50358497
Synonyms:
CHEMBL1923217
Type:
Small organic molecule
Emp. Form.:
C18H15ClN4O3
Mol. Mass.:
370.79
SMILES:
COc1ccc(Oc2ncc(Cl)c(Nc3ccccc3C(N)=O)n2)cc1
: