Target
Mitogen-activated protein kinase 10
Ligand
BDBM50358528
Substrate
Meas. Tech.
ChEMBL_789936 (CHEMBL1925289)
IC50
48±n/a nM
Citation
 Song, XChen, WLin, LRuiz, CHCameron, MDDuckett, DRKamenecka, TM Synthesis and SAR of 2-phenoxypyridines as novel c-Jun N-terminal kinase inhibitors. Bioorg Med Chem Lett 21:7072-5 (2011)  
Target
Name:
Mitogen-activated protein kinase 10
Synonyms:
JNK3 MAP kinase p49 3F12 MK10_HUMAN Mitogen-activated protein kinase 10 (Stress-activated protein kinase JNK3) (c-Jun N-terminal kinase 3) (MAP kinase p49 3F12) PRKM10 Stress-activated protein kinase JNK3 | c-Jun N-terminal kinase 3 (JNK3)
Type:
Enzyme
Mol. Mass.:
52586.89
Organism:
Homo sapiens (Human)
Description:
Residue:
464
  
Inhibitor
Name:
BDBM50358528
Synonyms:
CHEMBL1923186
Type:
Small organic molecule
Emp. Form.:
C19H16FN3O3
Mol. Mass.:
353.347
SMILES:
COc1ccc(Oc2cc(Nc3ccccc3C(N)=O)c(F)cn2)cc1
: