Target
Mitogen-activated protein kinase 8
Ligand
BDBM50358527
Substrate
Meas. Tech.
ChEMBL_789935 (CHEMBL1925288)
IC50
8±n/a nM
Citation
 Song, XChen, WLin, LRuiz, CHCameron, MDDuckett, DRKamenecka, TM Synthesis and SAR of 2-phenoxypyridines as novel c-Jun N-terminal kinase inhibitors. Bioorg Med Chem Lett 21:7072-5 (2011)  
Target
Name:
Mitogen-activated protein kinase 8
Synonyms:
JNK-46 JNK1-alpha-1 MK08_HUMAN PRKM8 SAPK1C c-Jun N-terminal kinase 1 c-Jun N-terminal kinase 1(JNK1) | c-Jun N-terminal kinase 2 (JNK2)
Type:
Enzyme
Mol. Mass.:
48297.57
Organism:
Homo sapiens (Human)
Description:
JNK-1 was purchased from Upstate Cell Signaling Solutions (formerly Upstate Biotechnology).
Residue:
427
  
Inhibitor
Name:
BDBM50358527
Synonyms:
CHEMBL1923187
Type:
Small organic molecule
Emp. Form.:
C19H16ClN3O3
Mol. Mass.:
369.802
SMILES:
COc1ccc(Oc2cc(Nc3ccccc3C(N)=O)c(Cl)cn2)cc1
: