Target
Cytochrome P450 2A6
Ligand
BDBM50358751
Substrate
Meas. Tech.
ChEMBL_789591 (CHEMBL1924632)
IC50
>100000±n/a nM
Citation
 Rahnasto, MKRaunio, HAWittekindt, CSalminen, KALeppänen, JJuvonen, ROPoso, ALahtela-Kakkonen, MK Identification of novel CYP2A6 inhibitors by virtual screening. Bioorg Med Chem 19:7186-93 (2011)  
Target
Name:
Cytochrome P450 2A6
Synonyms:
1,4-cineole 2-exo-monooxygenase CP2A6_HUMAN CYP2A6 Coumarin 7-hydroxylase Cytochrome P450 IIA3 | Cytochrome P450(I)
Type:
Protein
Mol. Mass.:
56514.34
Organism:
Homo sapiens (Human)
Description:
P11509
Residue:
494
  
Inhibitor
Name:
BDBM50358751
Synonyms:
CHEMBL1882851
Type:
Small organic molecule
Emp. Form.:
C4H4N4S2
Mol. Mass.:
172.231
SMILES:
Nc1nnc(SCC#N)s1
: