Target
Androgen receptor
Ligand
BDBM50359006
Substrate
Meas. Tech.
ChEMBL_791031 (CHEMBL1925692)
IC50
>50000±n/a nM
Citation
 Lack, NAAxerio-Cilies, PTavassoli, PHan, FQChan, KHFeau, CLeBlanc, EGuns, ETGuy, RKRennie, PSCherkasov, A Targeting the binding function 3 (BF3) site of the human androgen receptor through virtual screening. J Med Chem 54:8563-73 (2011)  
Target
Name:
Androgen receptor
Synonyms:
ANDR_HUMAN Androgen Receptor Androgen receptor/Baculoviral IAP repeat-containing protein 2 Dihydrotestosterone receptor Nuclear receptor subfamily 3 group C member 4
Type:
Receptor
Mol. Mass.:
99185.27
Organism:
Homo sapiens (Human)
Description:
CHO cells were stably transfected with human AR gene.
Residue:
920
  
Inhibitor
Name:
BDBM50359006
Synonyms:
CHEMBL1738936
Type:
Small organic molecule
Emp. Form.:
C24H24N2O2S
Mol. Mass.:
404.525
SMILES:
Cc1ccc(OCCn2c(SCCOc3ccccc3)nc3ccccc23)cc1
: