Target
Aldo-keto reductase family 1 member B1
Ligand
BDBM50359036
Substrate
Meas. Tech.
ChEMBL_789370 (CHEMBL1924248)
IC50
119200±n/a nM
Citation
 Fatmawati, SShimizu, KKondo, R Structure-activity relationships of ganoderma acids from Ganoderma lucidum as aldose reductase inhibitors. Bioorg Med Chem Lett 21:7295-7 (2011)  
Target
Name:
Aldo-keto reductase family 1 member B1
Synonyms:
AKR1B1 ALDR_HUMAN AR Aldose Reductase (ALR2) Aldose reductase (AR)
Type:
Protein
Mol. Mass.:
35855.50
Organism:
Homo sapiens (Human)
Description:
P15121. 4LAU; 2IKI; 4LB4; 2FZD; 2FZ8; 1US0
Residue:
316
  
Inhibitor
Name:
BDBM50359036
Synonyms:
CHEMBL1922171
Type:
Small organic molecule
Emp. Form.:
C30H42O7
Mol. Mass.:
514.6503
SMILES:
CC(CC(=O)C=C(C)[C@H]1C[C@H](O)[C@@]2(C)C3=C(C(=O)C[C@]12C)[C@@]1(C)CCC(=O)C(C)(C)[C@@H]1C[C@@H]3O)C(O)=O
: