Target
Amine oxidase [flavin-containing] B
Ligand
BDBM50359571
Substrate
Meas. Tech.
ChEMBL_792695 (CHEMBL1930522)
IC50
1860±n/a nM
Citation
 Booysen, HPMoraal, CTerre'Blanche, GPetzer, ABergh, JJPetzer, JP Thio- and aminocaffeine analogues as inhibitors of human monoamine oxidase. Bioorg Med Chem 19:7507-18 (2011)  
Target
Name:
Amine oxidase [flavin-containing] B
Synonyms:
AOFB_HUMAN MAOB Monoamine oxidase type B (MAO B) Monoamine oxidase type B (MAOB)
Type:
Protein
Mol. Mass.:
58768.76
Organism:
Homo sapiens (Human)
Description:
P27338
Residue:
520
  
Inhibitor
Name:
BDBM50359571
Synonyms:
CHEMBL1927666
Type:
Small organic molecule
Emp. Form.:
C15H16N4O2S
Mol. Mass.:
316.378
SMILES:
Cn1c(SCc2ccccc2)nc2n(C)c(=O)n(C)c(=O)c12
: