Target
Sodium-dependent serotonin transporter
Ligand
BDBM50359602
Substrate
Meas. Tech.
ChEMBL_793035 (CHEMBL1932601)
Ki
544±n/a nM
Citation
 Cararas, SAIzenwasser, SWade, DHousman, AVerma, ALomenzo, SATrudell, ML Further structure-activity relationship studies on 8-substituted-3-[2-(diarylmethoxyethylidenyl)]-8-azabicyclo[3.2.1]octane derivatives at monoamine transporters. Bioorg Med Chem 19:7551-8 (2011)  
Target
Name:
Sodium-dependent serotonin transporter
Synonyms:
5-HT Transporter 5HT transporter Anandamid membrane transporter, AMT Monoamine transporters; Norepinephrine & serotonin Slc6a4 Sodium-dependent serotonin transporter (SERT) | imipramine receptor
Type:
Multi-pass membrane protein
Mol. Mass.:
70168.43
Organism:
Rattus norvegicus (rat)
Description:
P31652
Residue:
630
  
Inhibitor
Name:
BDBM50359602
Synonyms:
CHEMBL1927880
Type:
Small organic molecule
Emp. Form.:
C29H30ClNO
Mol. Mass.:
444.008
SMILES:
Clc1ccc(CN2[C@H]3CC[C@@H]2C\C(C3)=C/COC(c2ccccc2)c2ccccc2)cc1
: