Target
Transporter
Ligand
BDBM50359597
Substrate
Meas. Tech.
ChEMBL_793036 (CHEMBL1932602)
Ki
2847±n/a nM
Citation
 Cararas, SAIzenwasser, SWade, DHousman, AVerma, ALomenzo, SATrudell, ML Further structure-activity relationship studies on 8-substituted-3-[2-(diarylmethoxyethylidenyl)]-8-azabicyclo[3.2.1]octane derivatives at monoamine transporters. Bioorg Med Chem 19:7551-8 (2011)  
Target
Name:
Transporter
Synonyms:
NE transporter Norepinephrine transporter(NET)
Type:
Multi-pass membrane protein
Mol. Mass.:
69236.90
Organism:
Rattus norvegicus (rat)
Description:
Q63380
Residue:
617
  
Inhibitor
Name:
BDBM50359597
Synonyms:
CHEMBL1927871
Type:
Small organic molecule
Emp. Form.:
C25H29F2NO
Mol. Mass.:
397.5007
SMILES:
CCCN1[C@H]2CC[C@@H]1C\C(C2)=C/COC(c1ccc(F)cc1)c1ccc(F)cc1
: