Target
Transporter
Ligand
BDBM50359603
Substrate
Meas. Tech.
ChEMBL_793036 (CHEMBL1932602)
Ki
5297±n/a nM
Citation
 Cararas, SAIzenwasser, SWade, DHousman, AVerma, ALomenzo, SATrudell, ML Further structure-activity relationship studies on 8-substituted-3-[2-(diarylmethoxyethylidenyl)]-8-azabicyclo[3.2.1]octane derivatives at monoamine transporters. Bioorg Med Chem 19:7551-8 (2011)  
Target
Name:
Transporter
Synonyms:
NE transporter Norepinephrine transporter(NET)
Type:
Multi-pass membrane protein
Mol. Mass.:
69236.90
Organism:
Rattus norvegicus (rat)
Description:
Q63380
Residue:
617
  
Inhibitor
Name:
BDBM50359603
Synonyms:
CHEMBL1927881
Type:
Small organic molecule
Emp. Form.:
C29H28ClF2NO
Mol. Mass.:
479.989
SMILES:
Fc1ccc(cc1)C(OC\C=C1\C[C@@H]2CC[C@H](C1)N2Cc1ccc(Cl)cc1)c1ccc(F)cc1
: