Target
Transporter
Ligand
BDBM50359604
Substrate
Meas. Tech.
ChEMBL_793036 (CHEMBL1932602)
Ki
1772±n/a nM
Citation
 Cararas, SAIzenwasser, SWade, DHousman, AVerma, ALomenzo, SATrudell, ML Further structure-activity relationship studies on 8-substituted-3-[2-(diarylmethoxyethylidenyl)]-8-azabicyclo[3.2.1]octane derivatives at monoamine transporters. Bioorg Med Chem 19:7551-8 (2011)  
Target
Name:
Transporter
Synonyms:
NE transporter Norepinephrine transporter(NET)
Type:
Multi-pass membrane protein
Mol. Mass.:
69236.90
Organism:
Rattus norvegicus (rat)
Description:
Q63380
Residue:
617
  
Inhibitor
Name:
BDBM50359604
Synonyms:
CHEMBL1927882
Type:
Small organic molecule
Emp. Form.:
C30H33NO
Mol. Mass.:
423.5891
SMILES:
Cc1ccc(CN2[C@H]3CC[C@@H]2C\C(C3)=C/COC(c2ccccc2)c2ccccc2)cc1
: