Target
Sodium-dependent dopamine transporter
Ligand
BDBM50359596
Substrate
Meas. Tech.
ChEMBL_793034 (CHEMBL1932600)
Ki
40±n/a nM
Citation
 Cararas, SAIzenwasser, SWade, DHousman, AVerma, ALomenzo, SATrudell, ML Further structure-activity relationship studies on 8-substituted-3-[2-(diarylmethoxyethylidenyl)]-8-azabicyclo[3.2.1]octane derivatives at monoamine transporters. Bioorg Med Chem 19:7551-8 (2011)  
Target
Name:
Sodium-dependent dopamine transporter
Synonyms:
DA transporter SC6A3_RAT Sodium-dependent dopamine transporter | Sodium-dependent dopamine transporter (DAT)
Type:
Multi-pass membrane protein
Mol. Mass.:
68749.45
Organism:
Rattus norvegicus (rat)
Description:
P23977
Residue:
619
  
Inhibitor
Name:
BDBM50359596
Synonyms:
CHEMBL1927869
Type:
Small organic molecule
Emp. Form.:
C24H27F2NO
Mol. Mass.:
383.4741
SMILES:
CCN1[C@H]2CC[C@@H]1C\C(C2)=C/COC(c1ccc(F)cc1)c1ccc(F)cc1
: