Target
Sodium-dependent dopamine transporter
Ligand
BDBM50359612
Substrate
Meas. Tech.
ChEMBL_793034 (CHEMBL1932600)
Ki
143±n/a nM
Citation
 Cararas, SAIzenwasser, SWade, DHousman, AVerma, ALomenzo, SATrudell, ML Further structure-activity relationship studies on 8-substituted-3-[2-(diarylmethoxyethylidenyl)]-8-azabicyclo[3.2.1]octane derivatives at monoamine transporters. Bioorg Med Chem 19:7551-8 (2011)  
Target
Name:
Sodium-dependent dopamine transporter
Synonyms:
DA transporter SC6A3_RAT Sodium-dependent dopamine transporter | Sodium-dependent dopamine transporter (DAT)
Type:
Multi-pass membrane protein
Mol. Mass.:
68749.45
Organism:
Rattus norvegicus (rat)
Description:
P23977
Residue:
619
  
Inhibitor
Name:
BDBM50359612
Synonyms:
CHEMBL1927872
Type:
Small organic molecule
Emp. Form.:
C25H29NO
Mol. Mass.:
359.5039
SMILES:
C=CCN1[C@H]2CC[C@@H]1C\C(C2)=C/COC(c1ccccc1)c1ccccc1
: