Target
Sodium-dependent dopamine transporter
Ligand
BDBM50359602
Substrate
Meas. Tech.
ChEMBL_793034 (CHEMBL1932600)
Ki
7.6±n/a nM
Citation
 Cararas, SAIzenwasser, SWade, DHousman, AVerma, ALomenzo, SATrudell, ML Further structure-activity relationship studies on 8-substituted-3-[2-(diarylmethoxyethylidenyl)]-8-azabicyclo[3.2.1]octane derivatives at monoamine transporters. Bioorg Med Chem 19:7551-8 (2011)  
Target
Name:
Sodium-dependent dopamine transporter
Synonyms:
DA transporter SC6A3_RAT Sodium-dependent dopamine transporter | Sodium-dependent dopamine transporter (DAT)
Type:
Multi-pass membrane protein
Mol. Mass.:
68749.45
Organism:
Rattus norvegicus (rat)
Description:
P23977
Residue:
619
  
Inhibitor
Name:
BDBM50359602
Synonyms:
CHEMBL1927880
Type:
Small organic molecule
Emp. Form.:
C29H30ClNO
Mol. Mass.:
444.008
SMILES:
Clc1ccc(CN2[C@H]3CC[C@@H]2C\C(C3)=C/COC(c2ccccc2)c2ccccc2)cc1
: