Target
3-beta-hydroxysteroid-Delta(8),Delta(7)-isomerase
Ligand
BDBM50419543
Substrate
Meas. Tech.
ChEMBL_792212 (CHEMBL1930739)
Ki
1.54±n/a nM
Citation
 Ferorelli, SAbate, CPedone, MPColabufo, NAContino, MPerrone, RBerardi, F Synthesis and binding assays of novel 3,3-dimethylpiperidine derivatives with various lipophilicities ass¿? receptor ligands. Bioorg Med Chem 19:7612-22 (2011)  
Target
Name:
3-beta-hydroxysteroid-Delta(8),Delta(7)-isomerase
Synonyms:
EBP | EBP_CAVPO
Type:
PROTEIN
Mol. Mass.:
26684.52
Organism:
Cavia porcellus
Description:
ChEMBL_203193
Residue:
229
  
Inhibitor
Name:
BDBM50419543
Synonyms:
CHEMBL1929275
Type:
Small organic molecule
Emp. Form.:
C20H31N
Mol. Mass.:
285.4668
SMILES:
CC1(C)CCCN(CCCCC2CCc3ccccc23)C1
: