Target
Cytochrome P450 1A2
Ligand
BDBM50359741
Substrate
Meas. Tech.
ChEMBL_791530 (CHEMBL1930583)
IC50
26000±n/a nM
Citation
 Tani, NRahnasto-Rilla, MWittekindt, CSalminen, KARitvanen, AOllakka, RKoskiranta, JRaunio, HJuvonen, RO Antifungal activities of novel non-azole molecules against S. cerevisiae and C. albicans. Eur J Med Chem 47:270-7 (2012)  
Target
Name:
Cytochrome P450 1A2
Synonyms:
CP1A2_HUMAN CYPIA2 Cytochrome P(3)450 Cytochrome P450 1A2 (CYP1A2) Cytochrome P450-P3
Type:
Enzyme
Mol. Mass.:
58423.38
Organism:
Homo sapiens (Human)
Description:
P05177
Residue:
516
  
Inhibitor
Name:
BDBM50359741
Synonyms:
CHEMBL1928095
Type:
Small organic molecule
Emp. Form.:
C27H22N2O2S
Mol. Mass.:
438.541
SMILES:
COc1ccc(cc1OC)-c1sc(\N=C\c2ccc(cc2)-c2ccccc2)c(C#N)c1C
: