Target
Cytochrome P450 2C9
Ligand
BDBM50359741
Substrate
Meas. Tech.
ChEMBL_791531 (CHEMBL1930584)
IC50
1400±n/a nM
Citation
 Tani, NRahnasto-Rilla, MWittekindt, CSalminen, KARitvanen, AOllakka, RKoskiranta, JRaunio, HJuvonen, RO Antifungal activities of novel non-azole molecules against S. cerevisiae and C. albicans. Eur J Med Chem 47:270-7 (2012)  
Target
Name:
Cytochrome P450 2C9
Synonyms:
(R)-limonene 6-monooxygenase CP2C9_HUMAN CYP2C9 Cytochrome P450 2C9 (CYP2C9 ) P-450MP P450 PB-1 | S-mephenytoin 4-hydroxylase
Type:
Enzyme
Mol. Mass.:
55636.33
Organism:
Homo sapiens (Human)
Description:
P11712
Residue:
490
  
Inhibitor
Name:
BDBM50359741
Synonyms:
CHEMBL1928095
Type:
Small organic molecule
Emp. Form.:
C27H22N2O2S
Mol. Mass.:
438.541
SMILES:
COc1ccc(cc1OC)-c1sc(\N=C\c2ccc(cc2)-c2ccccc2)c(C#N)c1C
: