Target
Cytochrome P450 2C19
Ligand
BDBM50359740
Substrate
Meas. Tech.
ChEMBL_791532 (CHEMBL1930585)
IC50
1100±n/a nM
Citation
 Tani, NRahnasto-Rilla, MWittekindt, CSalminen, KARitvanen, AOllakka, RKoskiranta, JRaunio, HJuvonen, RO Antifungal activities of novel non-azole molecules against S. cerevisiae and C. albicans. Eur J Med Chem 47:270-7 (2012)  
Target
Name:
Cytochrome P450 2C19
Synonyms:
(R)-limonene 6-monooxygenase (S)-limonene 7-monooxygenase CYP2C19 CYPIIC19 Cytochrome P450 2C19 [I331V] Cytochrome P450-254C Mephenytoin 4-hydroxylase P450-254C
Type:
Enzyme
Mol. Mass.:
55935.47
Organism:
Homo sapiens (Human)
Description:
P33261
Residue:
490
  
Inhibitor
Name:
BDBM50359740
Synonyms:
CHEMBL1928092
Type:
Small organic molecule
Emp. Form.:
C25H24N4O2S
Mol. Mass.:
444.549
SMILES:
COc1ccc(cc1OC)-c1sc(\N=C\c2ccc(cc2)N(C)CCC#N)c(C#N)c1C
: