Target
Cytochrome P450 2C19
Ligand
BDBM50359741
Substrate
Meas. Tech.
ChEMBL_791532 (CHEMBL1930585)
IC50
2300±n/a nM
Citation
 Tani, NRahnasto-Rilla, MWittekindt, CSalminen, KARitvanen, AOllakka, RKoskiranta, JRaunio, HJuvonen, RO Antifungal activities of novel non-azole molecules against S. cerevisiae and C. albicans. Eur J Med Chem 47:270-7 (2012)  
Target
Name:
Cytochrome P450 2C19
Synonyms:
(R)-limonene 6-monooxygenase (S)-limonene 7-monooxygenase CYP2C19 CYPIIC19 Cytochrome P450 2C19 [I331V] Cytochrome P450-254C Mephenytoin 4-hydroxylase P450-254C
Type:
Enzyme
Mol. Mass.:
55935.47
Organism:
Homo sapiens (Human)
Description:
P33261
Residue:
490
  
Inhibitor
Name:
BDBM50359741
Synonyms:
CHEMBL1928095
Type:
Small organic molecule
Emp. Form.:
C27H22N2O2S
Mol. Mass.:
438.541
SMILES:
COc1ccc(cc1OC)-c1sc(\N=C\c2ccc(cc2)-c2ccccc2)c(C#N)c1C
: