Target
Cytochrome P450 2D6
Ligand
BDBM50359740
Substrate
Meas. Tech.
ChEMBL_791533 (CHEMBL1930586)
IC50
23300±n/a nM
Citation
 Tani, NRahnasto-Rilla, MWittekindt, CSalminen, KARitvanen, AOllakka, RKoskiranta, JRaunio, HJuvonen, RO Antifungal activities of novel non-azole molecules against S. cerevisiae and C. albicans. Eur J Med Chem 47:270-7 (2012)  
Target
Name:
Cytochrome P450 2D6
Synonyms:
CP2D6_HUMAN CYP2DL1 Cytochrome P450 2D6 (CYP2D6) P450-DB1
Type:
Protein
Mol. Mass.:
55774.82
Organism:
Homo sapiens (Human)
Description:
P10635
Residue:
497
  
Inhibitor
Name:
BDBM50359740
Synonyms:
CHEMBL1928092
Type:
Small organic molecule
Emp. Form.:
C25H24N4O2S
Mol. Mass.:
444.549
SMILES:
COc1ccc(cc1OC)-c1sc(\N=C\c2ccc(cc2)N(C)CCC#N)c(C#N)c1C
: