Target
5-hydroxytryptamine receptor 1A
Ligand
BDBM50359960
Substrate
Meas. Tech.
ChEMBL_791368 (CHEMBL1930139)
Ki
6.67±n/a nM
Citation
 Fiorino, FSeverino, BMagli, EPerissutti, EFrecentese, FEsposito, AIncisivo, GMCiano, AMassarelli, PNencini, CSantagada, VCaliendo, G New potent 5-HT(2A) receptor ligands containing an N'-cyanopicolinamidine nucleus: Synthesis and in vitro pharmacological evaluation. Eur J Med Chem 47:520-9 (2012)  
Target
Name:
5-hydroxytryptamine receptor 1A
Synonyms:
5-HT-1A 5-HT1A 5-hydroxytryptamine receptor 1A (5HT1A) 5ht1a Htr1a Serotonin 1a (5-HT1a) receptor/Adrenergic receptor alpha-1 | Serotonin receptor 1A
Type:
G Protein-Coupled Receptor (GPCR)
Mol. Mass.:
46445.29
Organism:
Rattus norvegicus (rat)
Description:
Binding assays were performed using rat hippocampal membranes.
Residue:
422
  
Inhibitor
Name:
BDBM50359960
Synonyms:
CHEMBL1927094
Type:
Small organic molecule
Emp. Form.:
C20H23ClN6
Mol. Mass.:
382.89
SMILES:
Clc1cccc(c1)N1CCN(CCCN=C(NC#N)c2ccccn2)CC1
: