Target
D(1A) dopamine receptor
Ligand
BDBM50359961
Substrate
Meas. Tech.
ChEMBL_791369 (CHEMBL1930140)
Ki
>10000±n/a nM
Citation
 Fiorino, FSeverino, BMagli, EPerissutti, EFrecentese, FEsposito, AIncisivo, GMCiano, AMassarelli, PNencini, CSantagada, VCaliendo, G New potent 5-HT(2A) receptor ligands containing an N'-cyanopicolinamidine nucleus: Synthesis and in vitro pharmacological evaluation. Eur J Med Chem 47:520-9 (2012)  
Target
Name:
D(1A) dopamine receptor
Synonyms:
DOPAMINE D1 Dopamine D1 high Dopamine receptor Dopamine1-like Drd1a
Type:
Enzyme Catalytic Domain
Mol. Mass.:
49429.75
Organism:
RAT
Description:
P18901
Residue:
446
  
Inhibitor
Name:
BDBM50359961
Synonyms:
CHEMBL1927095
Type:
Small organic molecule
Emp. Form.:
C21H23F3N6
Mol. Mass.:
416.4427
SMILES:
FC(F)(F)c1cccc(c1)N1CCN(CCCN=C(NC#N)c2ccccn2)CC1
: