Target
Cannabinoid receptor 1
Ligand
BDBM50360023
Substrate
Meas. Tech.
ChEMBL_793705 (CHEMBL1932519)
Ki
2900±n/a nM
Citation
 Rogosch, TSinning, CPodlewski, AWatzer, BSchlosburg, JLichtman, AHCascio, MGBisogno, TDi Marzo, VNüsing, RImming, P Novel bioactive metabolites of dipyrone (metamizol). Bioorg Med Chem 20:101-7 (2011)  
Target
Name:
Cannabinoid receptor 1
Synonyms:
CANN6 CB-R CNR CNR1_HUMAN Cannabinoid receptor Cannabinoid receptor 1 (brain)
Type:
G Protein-Coupled Receptor (GPCR)
Mol. Mass.:
52868.96
Organism:
Homo sapiens (Human)
Description:
P21554
Residue:
472
  
Inhibitor
Name:
BDBM50360023
Synonyms:
CHEMBL1928337
Type:
Small organic molecule
Emp. Form.:
C31H43N3O2
Mol. Mass.:
489.692
SMILES:
CCCCC\C=C/C\C=C/C\C=C/C\C=C/CCCC(=O)Nc1c(C)n(C)n(-c2ccccc2)c1=O
: