Target
Prostaglandin G/H synthase 2
Ligand
BDBM85515
Substrate
Meas. Tech.
ChEMBL_793700 (CHEMBL1932514)
IC50
1000000±n/a nM
Citation
 Rogosch, TSinning, CPodlewski, AWatzer, BSchlosburg, JLichtman, AHCascio, MGBisogno, TDi Marzo, VNüsing, RImming, P Novel bioactive metabolites of dipyrone (metamizol). Bioorg Med Chem 20:101-7 (2011)  
Target
Name:
Prostaglandin G/H synthase 2
Synonyms:
Cox-2 Cyclooxygenase-2 Glucocorticoid-regulated inflammatory cyclooxygenase Macrophage activation-associated marker protein P71/73 PGH synthase 2 PGHS-2 Pghs-b Prostaglandin H2 synthase 2 Ptgs2 Tis10
Type:
Protein
Mol. Mass.:
69020.39
Organism:
Mus musculus (Mouse)
Description:
Q05769
Residue:
604
  
Inhibitor
Name:
BDBM85515
Synonyms:
Ampyrone EN300-17058 US11643395, Compound 9
Type:
Small organic molecule
Emp. Form.:
C11H13N3O
Mol. Mass.:
203.2404
SMILES:
Cc1c(N)c(=O)n(-c2ccccc2)n1C
: