Target
Phosphatidylinositol 4,5-bisphosphate 3-kinase catalytic subunit beta isoform
Ligand
BDBM50360061
Substrate
Meas. Tech.
ChEMBL_793748 (CHEMBL1932609)
IC50
230±n/a nM
Citation
 Kendall, JDGiddens, ACTsang, KYFrédérick, RMarshall, ESSingh, RLill, CLLee, WJKolekar, SChao, MMalik, AYu, SChaussade, CBuchanan, CRewcastle, GWBaguley, BCFlanagan, JUJamieson, SMDenny, WAShepherd, PR Novel pyrazolo[1,5-a]pyridines as p110a-selective PI3 kinase inhibitors: Exploring the benzenesulfonohydrazide SAR. Bioorg Med Chem 20:58-68 (2011)  
Target
Name:
Phosphatidylinositol 4,5-bisphosphate 3-kinase catalytic subunit beta isoform
Synonyms:
PI3-kinase p110 subunit beta PI3Kbeta PIK3CB Phosphatidylinositol 4,5-bisphosphate 3-kinase catalytic subunit beta (PI3Kbeta) Phosphatidylinositol 4,5-bisphosphate 3-kinase catalytic subunit beta isoform (PI3K) Phosphatidylinositol 4,5-bisphosphate 3-kinase catalytic subunit beta isoform (PI3Kbeta) Phosphatidylinositol-4,5-bisphosphate 3-kinase catalytic subunit beta isoform Phosphoinositide 3-Kinase (PI3K), beta Chain A PtdIns-3-kinase p110
Type:
Enzyme Subunit
Mol. Mass.:
122769.00
Organism:
Homo sapiens (Human)
Description:
P42338
Residue:
1070
  
Inhibitor
Name:
BDBM50360061
Synonyms:
CHEMBL1928559
Type:
Small organic molecule
Emp. Form.:
C22H23N7O5S
Mol. Mass.:
497.527
SMILES:
Cc1ccc(cc1S(=O)(=O)N(CCN1CCOCC1)\N=C\c1cnn2ccc(cc12)C#N)[N+]([O-])=O
: