Target
Delta-type opioid receptor
Ligand
BDBM50360142
Substrate
Meas. Tech.
ChEMBL_793540 (CHEMBL1932291)
Ki
0.270000±n/a nM
Citation
 Ida, YNemoto, THirayama, SFujii, HOsa, YImai, MNakamura, TKanemasa, TKato, ANagase, H Synthesis of quinolinomorphinan-4-ol derivatives asd opioid receptor agonists. Bioorg Med Chem 20:949-61 (2012)  
Target
Name:
Delta-type opioid receptor
Synonyms:
Cytochrome P450 3A4 Delta opioid receptor Delta-type opioid receptor (DOR) OPRD_RAT Opioid receptor Opioid receptors; mu & delta Ror-a | Voltage-gated potassium channel
Type:
G Protein-Coupled Receptor (GPCR)
Mol. Mass.:
40465.04
Organism:
Rattus norvegicus (rat)
Description:
Competition binding assays were using CHO-K1 cell membranes expressing the opioid receptor.
Residue:
372
  
Inhibitor
Name:
BDBM50360142
Synonyms:
CHEMBL1929365
Type:
Small organic molecule
Emp. Form.:
C27H28N2O
Mol. Mass.:
396.524
SMILES:
Oc1cccc2C[C@@H]3[C@@H]4Cc5cc6ccccc6nc5C[C@]4(CCN3CC3CC3)c12
: