Target
Ribosomal protein S6 kinase alpha-3
Ligand
BDBM50360293
Substrate
Meas. Tech.
ChEMBL_795811 (CHEMBL1936698)
IC50
40±n/a nM
Citation
 Kirrane, TMBoyer, SJBurke, JGuo, XSnow, RJSoleymanzadeh, LSwinamer, AZhang, YMadwed, JBKashem, MKugler, SO'Neill, MM Indole RSK inhibitors. Part 2: optimization of cell potency and kinase selectivity. Bioorg Med Chem Lett 22:738-42 (2011)  
Target
Name:
Ribosomal protein S6 kinase alpha-3
Synonyms:
90 kDa ribosomal protein S6 kinase 3 ISPK1 MAP kinase-activated protein kinase 1b RPS6KA3 RSK2 Ribosomal protein S6 kinase Ribosomal protein S6 kinase alpha-3 (RSK2) S6K-alpha 3 p90 ribosomal s6 kinase (RSK2) p90RSK | pp90RSK2
Type:
Serine/threonine-protein kinase
Mol. Mass.:
83740.03
Organism:
Homo sapiens (Human)
Description:
The human RSK2 sequence differed from the Genbank entry NM_004586 at one residue, V45G. The protein was cloned and purified from baculovirus expression system.
Residue:
740
  
Inhibitor
Name:
BDBM50360293
Synonyms:
CHEMBL1933280 | US9150577, 81
Type:
Small organic molecule
Emp. Form.:
C22H21N5O2
Mol. Mass.:
387.4344
SMILES:
CCn1c(NC(=O)c2ccc3cc4C(=O)NCCCn4c3c2)nc2ccccc12
: