Target
Broad substrate specificity ATP-binding cassette transporter ABCG2
Ligand
BDBM29142
Substrate
Meas. Tech.
ChEMBL_795926 (CHEMBL1936799)
IC50
10720±n/a nM
Citation
 Juvale, KPape, VFWiese, M Investigation of chalcones and benzochalcones as inhibitors of breast cancer resistance protein. Bioorg Med Chem 20:346-55 (2011)  
Target
Name:
Broad substrate specificity ATP-binding cassette transporter ABCG2
Synonyms:
ABCG2 ABCP ATP-binding cassette sub-family G member 2 ATP-binding cassette, sub-family G, member 2 BCRP1 CDw338 Mitoxantrone resistance-associated protein Urate exporter
Type:
Multi-pass membrane protein; monomer or homodimer; disulfide-linked
Mol. Mass.:
72329.48
Organism:
Homo sapiens (Human)
Description:
Q9UNQ0
Residue:
655
  
Inhibitor
Name:
BDBM29142
Synonyms:
substituted chalcone, 5i
Type:
Small organic molecule
Emp. Form.:
C16H13ClO3
Mol. Mass.:
288.726
SMILES:
COc1ccc(C(=O)\C=C\c2ccc(Cl)cc2)c(O)c1
: