Target
Sphingosine 1-phosphate receptor 4
Ligand
BDBM50360542
Substrate
Meas. Tech.
ChEMBL_795350 (CHEMBL1937206)
EC50
287±n/a nM
Citation
 Guerrero, MUrbano, MZhao, JCrisp, MChase, PHodder, PSchaeffer, MTBrown, SRosen, HRoberts, E Discovery, design and synthesis of novel potent and selective sphingosine-1-phosphate 4 receptor (S1P4-R) agonists. Bioorg Med Chem Lett 22:537-42 (2011)  
Target
Name:
Sphingosine 1-phosphate receptor 4
Synonyms:
EDG6 S1P receptor 4 S1P4 S1PR4_HUMAN Sphingosine 1-phosphate receptor Edg-6 sphingosine-1-phosphate 4 S1P4
Type:
G Protein-Coupled Receptor (GPCR)
Mol. Mass.:
41647.39
Organism:
Homo sapiens (Human)
Description:
Residue:
384
  
Inhibitor
Name:
BDBM50360542
Synonyms:
CHEMBL1933155
Type:
Small organic molecule
Emp. Form.:
C14H12Cl2INO3
Mol. Mass.:
440.06
SMILES:
OCc1ccc(OCCOc2ccc(Cl)cc2Cl)c(I)n1
: