Target
Proto-oncogene tyrosine-protein kinase Src
Ligand
BDBM50360636
Substrate
Meas. Tech.
ChEMBL_795748 (CHEMBL1936377)
IC50
>150000±n/a nM
Citation
 Rao, VKChhikara, BSTiwari, RShirazi, ANParang, KKumar, A One-pot regioselective synthesis of tetrahydroindazolones and evaluation of their antiproliferative and Src kinase inhibitory activities. Bioorg Med Chem Lett 22:410-4 (2011)  
Target
Name:
Proto-oncogene tyrosine-protein kinase Src
Synonyms:
Calmodulin/Proto-oncogene tyrosine-protein kinase Src Proto-oncogene c-Src SRC SRC_HUMAN V-src sarcoma (Schmidt-Ruppin A-2) viral oncogene homolog (avian) p60-Src | pp60c-src
Type:
Protein
Mol. Mass.:
59838.60
Organism:
Homo sapiens (Human)
Description:
P12931
Residue:
536
  
Inhibitor
Name:
BDBM50360636
Synonyms:
CHEMBL1933732
Type:
Small organic molecule
Emp. Form.:
C22H20Cl2N2O
Mol. Mass.:
399.313
SMILES:
Cc1ccc(cc1)-n1nc2CC(C)(C)CC(=O)c2c1-c1ccc(Cl)c(Cl)c1
: