Target
Histamine H3 receptor
Ligand
BDBM50360986
Substrate
Meas. Tech.
ChEMBL_795961 (CHEMBL1936233)
Ki
38±n/a nM
Citation
 Becknell, NCDandu, RRLyons, JAAimone, LDRaddatz, RHudkins, RL Synthesis and evaluation of 4-alkoxy-[1'-cyclobutyl-spiro(3,4-dihydrobenzopyran-2,4'-piperidine)] analogues as histamine-3 receptor antagonists. Bioorg Med Chem Lett 22:186-9 (2011)  
Target
Name:
Histamine H3 receptor
Synonyms:
G-protein coupled receptor 97 HH3R HRH3 Histamine H3 receptor (H3) Histamine receptor (H3 and H4)
Type:
G Protein-Coupled Receptor (GPCR)
Mol. Mass.:
48691.47
Organism:
Homo sapiens (Human)
Description:
Binding assays were using CHO cells stably expressing hH3R receptors.
Residue:
445
  
Inhibitor
Name:
BDBM50360986
Synonyms:
CHEMBL1935413
Type:
Small organic molecule
Emp. Form.:
C20H29NO2S
Mol. Mass.:
347.515
SMILES:
CSCCOc1ccc2OC3(CCN(CC3)C3CCC3)CCc2c1
: