Target
Natural resistance-associated macrophage protein 2
Ligand
BDBM50361135
Substrate
Meas. Tech.
ChEMBL_795244 (CHEMBL1936903)
IC50
150±n/a nM
Citation
 Cadieux, JAZhang, ZMattice, MBrownlie-Cutts, AFu, JRatkay, LGKwan, RThompson, JSanghara, JZhong, JGoldberg, YP Synthesis and biological evaluation of substituted pyrazoles as blockers of divalent metal transporter 1 (DMT1). Bioorg Med Chem Lett 22:90-5 (2011)  
Target
Name:
Natural resistance-associated macrophage protein 2
Synonyms:
DCT1 DMT1 Divalent metal transporter 1 NRAMP 2 SLC11A2
Type:
PROTEIN
Mol. Mass.:
62262.02
Organism:
Homo sapiens (Human)
Description:
ChEMBL_795244
Residue:
568
  
Inhibitor
Name:
BDBM50361135
Synonyms:
CHEMBL1933610
Type:
Small organic molecule
Emp. Form.:
C16H12F3N3O
Mol. Mass.:
319.2812
SMILES:
Cc1[nH]n(-c2ccccn2)c(=O)c1-c1ccc(cc1)C(F)(F)F
: