Target
Prostaglandin E synthase
Ligand
BDBM50006805
Substrate
Meas. Tech.
ChEMBL_794983 (CHEMBL1936310)
IC50
1600±n/a nM
Citation
 Wiegard, AHanekamp, WGriessbach, KFabian, JLehr, M Pyrrole alkanoic acid derivatives as nuisance inhibitors of microsomal prostaglandin E2 synthase-1. Eur J Med Chem 48:153-63 (2012)  
Target
Name:
Prostaglandin E synthase
Synonyms:
MGST1L1 PGES PTGES Prostaglandin E synthase (PGES-1) Prostaglandin E synthase-1 (PGES-1) Prostaglandin E2 synthase-1 ( mPGES-1)
Type:
Protein
Mol. Mass.:
17112.22
Organism:
Homo sapiens (Human)
Description:
Residue:
152
  
Inhibitor
Name:
BDBM50006805
Synonyms:
3-(1-(4-chlorobenzyl)-3-(tert-butylthio)-5-isopropyl-1H-indol-2-yl)-2,2-dimethylpropanoic acid 3-[1-(4-chlorobenzyl)-3-t-butyl-thio-5-isopropylindol-2-yl]-2,2-dimethylpropanoic acid CHEMBL29097 MK886 | cid_3651377
Type:
Small organic molecule
Emp. Form.:
C27H34ClNO2S
Mol. Mass.:
472.082
SMILES:
CC(C)c1ccc2n(Cc3ccc(Cl)cc3)c(CC(C)(C)C(O)=O)c(SC(C)(C)C)c2c1
: